[visit-users] Visit build problem

John R Cary cary at txcorp.com
Sun Mar 21 11:34:59 EDT 2010


I am building visit out of place using

env LD_RUN_PATH=/usr/local/contrib-openmpi-1.4.1/mesa/lib: cmake -D CMAKE_INSTALL_PREFIX:PATH=/usr/local/contrib-openmpi-1.4.1/visit-r10454-ser -D CMAKE_BUILD_TYPE:STRING=RELEASE -D CMAKE_VERBOSE_MAKEFILE:BOOL=TRUE   -DCMAKE_CXX_FLAGS:STRING='-DGLEW_DEBUG' -DCMAKE_C_FLAGS:STRING='-DGLEW_DEBUG' -D HDF5_DIR:PATH=/usr/local/contrib-openmpi-1.4.1/hdf5 -D VISIT_VTK_DIR:PATH=/usr/local/contrib-openmpi-1.4.1/vtk/lib/vtk-5.0 -D MESA_DIR:PATH=/usr/local/contrib-openmpi-1.4.1/mesa -D QT_LIBRARY_DIR:PATH=/usr/local/contrib-openmpi-1.4.1/qt/lib -D QT_BINARY_DIR:PATH=/usr/local/contrib-openmpi-1.4.1/qt/bin -D VISIT_QT_BIN:PATH=/usr/local/contrib-openmpi-1.4.1/qt/bin -D QT_QMAKE_EXECUTABLE:FILEPATH=/usr/local/contrib-openmpi-1.4.1/qt/bin/qmake -D PYTHON_INCLUDE_PATH:PATH=/usr/include/python2.6 -D PYTHON_LIBRARY:FILEPATH=/usr/lib64/libpython2.6.so  /home/research/cary/projects/visitall/visit

It stops at

make[2]: Entering directory `/home/research/cary/projects/visitall/builds/visit/ser'
/usr/local/contrib-openmpi-1.4.1/cmake-2.8.1-rc2-ser/bin/cmake -E cmake_progress_report /home/research/cary/projects/visitall/builds/visit/ser/CMakeFiles 
[ 30%] Building C object sim/V1/lib/CMakeFiles/sim.dir/VisItControlInterface_V1.c.o
cd /home/research/cary/projects/visitall/builds/visit/ser/sim/V1/lib && /usr/lib64/ccache/gcc  -D_LARGEFILE64_SOURCE -DGLEW_DEBUG  -O3 -DNDEBUG -I/home/research/cary/projects/visitall/visit/sim/V1/lib -I/home/research/cary/projects/visitall/visit/databases/SimV1 -I/home/research/cary/projects/visitall/visit/include   -o CMakeFiles/sim.dir/VisItControlInterface_V1.c.o   -c /home/research/cary/projects/visitall/visit/sim/V1/lib/VisItControlInterface_V1.c
/home/research/cary/projects/visitall/visit/sim/V1/lib/VisItControlInterface_V1.c:58:26: error: visit-config.h: No such file or directory
make[2]: *** [sim/V1/lib/CMakeFiles/sim.dir/VisItControlInterface_V1.c.o] Error 1
make[2]: Leaving directory `/home/research/cary/projects/visitall/builds/visit/ser'
make[1]: *** [sim/V1/lib/CMakeFiles/sim.dir/all] Error 2
make[1]: Leaving directory `/home/research/cary/projects/visitall/builds/visit/ser'
make: *** [all] Error 2
octet.cary$ find . -name visit-config.h -print
./include/visit-config.h

Looks like the includes should also include $top_builddir/include?

Best.....John




-- 
John R Cary
cary at txcorp.com





More information about the visit-users mailing list