[visit-developers] DAVINCI-VisIt Testing: gmake -j 4 failed in src

tom fogal tfogal at alumni.unh.edu
Wed May 6 12:09:41 EDT 2009


visit-developers at ornl.gov writes:
> indexfile.C: In member function 'int64_t H5_Index::getH5PartVariableInfo(std:
> :string, int64_t, std::vector<long int, std::allocator<long int> >&, BaseFile
> Interface::DataType*)':
> indexfile.C:450: error: 'H5PART_FLOAT32' was not declared in this scope
> indexfile.C: In member function 'void H5_Index::getH5PartData(std::string, in
> t64_t, void*)':
> indexfile.C:558: error: 'H5PART_FLOAT32' was not declared in this scope
> indexfile.C:559: error: 'h5part_float32_t' was not declared in this scope
> indexfile.C:559: error: expected primary-expression before ')' token
> indexfile.C:559: error: 'H5PartReadDataFloat32' was not declared in this scop

This error looks familiar, seems like we've hit this a few times.

Are we missing a dependency on davinci?

-tom


More information about the visit-developers mailing list